module github.cedric1996.com/go-trader

go 1.14

require (
	code.gitea.io/gitea v1.14.5 // indirect
	gitea.com/lunny/log v0.0.0-20190322053110-01b5df579c4e
	github.com/alecthomas/assert v0.0.0-20170929043011-405dbfeb8e38
	github.com/alecthomas/colour v0.1.0 // indirect
	github.com/alecthomas/repr v0.0.0-20210301060118-828286944d6a // indirect
	github.com/go-redis/redis/v7 v7.4.0
	github.com/go-redis/redis/v8 v8.8.0
	github.com/mattn/go-isatty v0.0.12 // indirect
	github.com/sergi/go-diff v1.2.0 // indirect
	github.com/spf13/viper v1.7.1
	github.com/unknwon/com v1.0.1
	github.com/urfave/cli v1.22.5
	github.com/xdg/scram v0.0.0-20180814205039-7eeb5667e42c // indirect
	github.com/xdg/stringprep v0.0.0-20180714160509-73f8eece6fdc // indirect
	go.mongodb.org/mongo-driver v1.5.1
	google.golang.org/grpc v1.39.0
	gopkg.in/mgo.v2 v2.0.0-20190816093944-a6b53ec6cb22
)
